Reaction Details
TargetfMet-Leu-Phe receptor
LigandBDBM50418334
Substrate/Competitorn/a
Meas. Tech.ChEMBL_744770 (CHEMBL1772791)
IC50 25119±n/a nM
Citation Unitt, JFagura, MPhillips, TKing, SPerry, MMorley, AMacDonald, CWeaver, RChristie, JBarber, SMohammed, RPaul, MCook, ABaxter, A Discovery of small molecule human FPR1 receptor antagonists. Bioorg Med Chem Lett21:2991-7 (2011) 
 
fMet-Leu-Phe receptor
Name:fMet-Leu-Phe receptor
Type:PROTEIN
Mol. Mass.:40342.61
Organism:Mus musculus
Description:ChEMBL_744770
Residue:364
BDBM50418334
NameBDBM50418334
Synonyms:CHEMBL1770298
TypeSmall organic molecule
Emp. Form.C22H22N2O3S
Mol. Mass.394.487
SMILESCc1ccc(s1)C(NC(=O)c1ccccc1O)C(=O)Nc1c(C)cccc1C