Reaction Details
TargetVasopressin V1a receptor
LigandBDBM50418366
Substrate/Competitorn/a
Meas. Tech.ChEMBL_746762 (CHEMBL1776931)
Ki 0.234±n/a nM
Citation Napier, SWishart, GArbuckle, WBaker, JBarn, DBingham, MBrown, AByford, AClaxton, CCraighead, MBuchanan, KFielding, LGibson, LGoodwin, RGoutcher, SIrving, NMacSweeney, CMilne, RMort, CPresland, JSloan, HThomson, FTurnbull, ZYoung, T The discovery of novel 8-azabicyclo[3.2.1]octan-3-yl)-3-(4-chlorophenyl) propanamides as vasopressin V1A receptor antagonists. Bioorg Med Chem Lett21:3163-7 (2011) 
 
Vasopressin V1a receptor
Name:Vasopressin V1a receptor
Type:Receptor
Mol. Mass.:46820.18
Organism:Homo sapiens (Human)
Description:P37288
Residue:418
BDBM50418366
NameBDBM50418366
Synonyms:CHEMBL1774023
TypeSmall organic molecule
Emp. Form.C24H27Cl2N3O2
Mol. Mass.460.396
SMILESClc1ccc(C[C@@H](NC(=O)Cc2ccc(Cl)cc2)C(=O)N[C@@H]2C[C@@H]3CC[C@H](C2)N3)cc1