Reaction Details
TargetVasopressin V1a receptor
LigandBDBM50418384
Substrate/Competitorn/a
Meas. Tech.ChEMBL_746762 (CHEMBL1776931)
Ki 5.62±n/a nM
Citation Napier, SWishart, GArbuckle, WBaker, JBarn, DBingham, MBrown, AByford, AClaxton, CCraighead, MBuchanan, KFielding, LGibson, LGoodwin, RGoutcher, SIrving, NMacSweeney, CMilne, RMort, CPresland, JSloan, HThomson, FTurnbull, ZYoung, T The discovery of novel 8-azabicyclo[3.2.1]octan-3-yl)-3-(4-chlorophenyl) propanamides as vasopressin V1A receptor antagonists. Bioorg Med Chem Lett21:3163-7 (2011) 
 
Vasopressin V1a receptor
Name:Vasopressin V1a receptor
Type:Receptor
Mol. Mass.:46820.18
Organism:Homo sapiens (Human)
Description:P37288
Residue:418
BDBM50418384
NameBDBM50418384
Synonyms:CHEMBL1774000
TypeSmall organic molecule
Emp. Form.C26H29ClN2O4S
Mol. Mass.501.037
SMILESCOc1cc(C)c(c(C)c1C)S(=O)(=O)N[C@@H](Cc1ccc(Cl)cc1)C(=O)NCc1ccccc1