Reaction Details
TargetC-C chemokine receptor type 5
LigandBDBM50418500
Substrate/Competitorn/a
Meas. Tech.ChEMBL_751710 (CHEMBL1788061)
IC50 19.95±n/a nM
Citation Kazmierski, WMAnderson, DLAquino, CChauder, BADuan, MFerris, RKenakin, TKoble, CSLang, DGMcIntyre, MSPeckham, JWatson, CWheelan, PSpaltenstein, AWire, MBSvolto, AYoungman, M Novel 4,4-disubstituted piperidine-based C-C chemokine receptor-5 inhibitors with high potency against human immunodeficiency virus-1 and an improved human ether-a-go-go related gene (hERG) profile. J Med Chem54:3756-67 (2011) 
 
C-C chemokine receptor type 5
Name:C-C chemokine receptor type 5
Type:Enzyme
Mol. Mass.:40540.21
Organism:Homo sapiens (Human)
Description:P51681
Residue:352
BDBM50418500
NameBDBM50418500
Synonyms:CHEMBL1784401
TypeSmall organic molecule
Emp. Form.C34H39N5O
Mol. Mass.533.7064
SMILESCc1nc2cccnc2n1C1CC2CCC(C1)N2CCC1(CCN(CC1)C(=O)c1ccccc1)c1ccccc1