Reaction Details
TargetPeroxisome proliferator-activated receptor gamma
LigandBDBM50418570
Substrate/Competitorn/a
Meas. Tech.ChEMBL_749292 (CHEMBL1785227)
Ki 175000000±n/a nM
Citation Dixit, ASaxena, AK QSAR analysis of PPAR-gamma agonists as anti-diabetic agents. Eur J Med Chem43:73-80 (2008) 
 
Peroxisome proliferator-activated receptor gamma
Name:Peroxisome proliferator-activated receptor gamma
Type:Nuclear Receptor
Mol. Mass.:57613.46
Organism:Homo sapiens (Human)
Description:P37231
Residue:505
BDBM50418570
NameBDBM50418570
Synonyms:CHEMBL1785076
TypeSmall organic molecule
Emp. Form.C21H23NO4
Mol. Mass.353.4116
SMILESCC(=O)CC(C)=N[C@@H](Cc1ccc(OCc2ccccc2)cc1)C(O)=O