Reaction Details
TargetNociceptin receptor
LigandBDBM50181392
Substrate/Competitorn/a
Meas. Tech.ChEMBL_750576 (CHEMBL1786440)
Ki 0.239883±n/a nM
Citation Trapella, CFischetti, CPela', MLazzari, IGuerrini, RCalo', GRizzi, ACamarda, VLambert, DGMcDonald, JRegoli, DSalvadori, S Structure-activity studies on the nociceptin/orphanin FQ receptor antagonist 1-benzyl-N-{3-[spiroisobenzofuran-1(3H),4'-piperidin-1-yl]propyl} pyrrolidine-2-carboxamide. Bioorg Med Chem17:5080-95 (2009) 
 
Nociceptin receptor
Name:Nociceptin receptor
Type:G Protein-Coupled Receptor (GPCR)
Mol. Mass.:40702.87
Organism:Homo sapiens (Human)
Description:P41146
Residue:370
BDBM50181392
NameBDBM50181392
Synonyms:(R)-N-(3-(3H-spiro[isobenzofuran-1,4'-piperidine]-1'-yl)propyl)-1-benzylpyrrolidine-2-carboxamide CHEMBL201945
TypeSmall organic molecule
Emp. Form.C27H35N3O2
Mol. Mass.433.5857
SMILESO=C(NCCCN1CCC2(CC1)OCc1ccccc21)[C@H]1CCCN1Cc1ccccc1