Reaction Details
TargetMitogen-activated protein kinase 14
LigandBDBM50418603
Substrate/Competitorn/a
Meas. Tech.ChEMBL_749731 (CHEMBL1787752)
Ki 10±n/a nM
Citation Aston, NMBamborough, PBuckton, JBEdwards, CDHolmes, DSJones, KLPatel, VKSmee, PASomers, DOVitulli, GWalker, AL p38alpha mitogen-activated protein kinase inhibitors: optimization of a series of biphenylamides to give a molecule suitable for clinical progression. J Med Chem52:6257-69 (2009) 
 
Mitogen-activated protein kinase 14
Name:Mitogen-activated protein kinase 14
Type:Serine/threonine-protein kinase
Mol. Mass.:41286.76
Organism:Homo sapiens (Human)
Description:Q16539
Residue:360
BDBM50418603
NameBDBM50418603
Synonyms:CHEMBL1784169
TypeSmall organic molecule
Emp. Form.C23H22FN3O2S
Mol. Mass.423.503
SMILESCc1nc(CNC(=O)c2ccc(cc2)-c2cc(cc(F)c2C)C(=O)NC2CC2)cs1