Reaction Details
TargetMitogen-activated protein kinase 14
LigandBDBM50418607
Substrate/Competitorn/a
Meas. Tech.ChEMBL_749733 (CHEMBL1787754)
IC50 158.49±n/a nM
Citation Aston, NMBamborough, PBuckton, JBEdwards, CDHolmes, DSJones, KLPatel, VKSmee, PASomers, DOVitulli, GWalker, AL p38alpha mitogen-activated protein kinase inhibitors: optimization of a series of biphenylamides to give a molecule suitable for clinical progression. J Med Chem52:6257-69 (2009) 
 
Mitogen-activated protein kinase 14
Name:Mitogen-activated protein kinase 14
Type:Serine/threonine-protein kinase
Mol. Mass.:41286.76
Organism:Homo sapiens (Human)
Description:Q16539
Residue:360
BDBM50418607
NameBDBM50418607
Synonyms:CHEMBL1784173
TypeSmall organic molecule
Emp. Form.C21H24FN3O2
Mol. Mass.369.4326
SMILESCC(C)CNC(=O)c1ccc(nc1)-c1cc(cc(F)c1C)C(=O)NC1CC1