Reaction Details
TargetMitogen-activated protein kinase 14
LigandBDBM50418608
Substrate/Competitorn/a
Meas. Tech.ChEMBL_749734 (CHEMBL1787755)
IC50 19.95±n/a nM
Citation Aston, NMBamborough, PBuckton, JBEdwards, CDHolmes, DSJones, KLPatel, VKSmee, PASomers, DOVitulli, GWalker, AL p38alpha mitogen-activated protein kinase inhibitors: optimization of a series of biphenylamides to give a molecule suitable for clinical progression. J Med Chem52:6257-69 (2009) 
 
Mitogen-activated protein kinase 14
Name:Mitogen-activated protein kinase 14
Type:Serine/threonine-protein kinase
Mol. Mass.:41286.76
Organism:Homo sapiens (Human)
Description:Q16539
Residue:360
BDBM50418608
NameBDBM50418608
Synonyms:CHEMBL1784174
TypeSmall organic molecule
Emp. Form.C22H26FN3O2
Mol. Mass.383.4591
SMILESCC(C)[C@@H](C)NC(=O)c1ccc(nc1)-c1cc(cc(F)c1C)C(=O)NC1CC1