Reaction Details
TargetMitogen-activated protein kinase 14
LigandBDBM50418615
Substrate/Competitorn/a
Meas. Tech.ChEMBL_749731 (CHEMBL1787752)
Ki 125.89±n/a nM
Citation Aston, NMBamborough, PBuckton, JBEdwards, CDHolmes, DSJones, KLPatel, VKSmee, PASomers, DOVitulli, GWalker, AL p38alpha mitogen-activated protein kinase inhibitors: optimization of a series of biphenylamides to give a molecule suitable for clinical progression. J Med Chem52:6257-69 (2009) 
 
Mitogen-activated protein kinase 14
Name:Mitogen-activated protein kinase 14
Type:Serine/threonine-protein kinase
Mol. Mass.:41286.76
Organism:Homo sapiens (Human)
Description:Q16539
Residue:360
BDBM50418615
NameBDBM50418615
Synonyms:CHEMBL1784167
TypeSmall organic molecule
Emp. Form.C22H23FN2O2
Mol. Mass.366.4286
SMILESCc1cc(F)c(cc1-c1ccc(cc1)C(=O)NCC1CC1)C(=O)NC1CC1