Reaction Details
TargetMitogen-activated protein kinase 14
LigandBDBM50418606
Substrate/Competitorn/a
Meas. Tech.ChEMBL_749734 (CHEMBL1787755)
IC50 79.43±n/a nM
Citation Aston, NMBamborough, PBuckton, JBEdwards, CDHolmes, DSJones, KLPatel, VKSmee, PASomers, DOVitulli, GWalker, AL p38alpha mitogen-activated protein kinase inhibitors: optimization of a series of biphenylamides to give a molecule suitable for clinical progression. J Med Chem52:6257-69 (2009) 
 
Mitogen-activated protein kinase 14
Name:Mitogen-activated protein kinase 14
Type:Serine/threonine-protein kinase
Mol. Mass.:41286.76
Organism:Homo sapiens (Human)
Description:Q16539
Residue:360
BDBM50418606
NameBDBM50418606
Synonyms:CHEMBL1784172
TypeSmall organic molecule
Emp. Form.C21H22FN3O2
Mol. Mass.367.4167
SMILESCc1c(F)cc(cc1-c1ccc(cn1)C(=O)NCC1CC1)C(=O)NC1CC1