Reaction Details
TargetEpidermal growth factor receptor
LigandBDBM50122567
Substrate/Competitorn/a
Meas. Tech.ChEMBL_753968 (CHEMBL1798351)
IC50 309.03±n/a nM
Citation San Juan, AA Towards predictive inhibitor design for the EGFR autophosphorylation activity. Eur J Med Chem43:781-91 (2008) 
 
Epidermal growth factor receptor
Name:Epidermal growth factor receptor
Type:Receptor Kinase Domain
Mol. Mass.:134279.59
Organism:Homo sapiens (Human)
Description:P00533
Residue:1210
BDBM50122567
NameBDBM50122567
Synonyms:(E)-4-Dimethylamino-but-2-enoic acid [4-(3-bromo-phenylamino)-3-cyano-quinolin-6-yl]-amide CHEMBL30973
TypeSmall organic molecule
Emp. Form.C22H20BrN5O
Mol. Mass.450.331
SMILESCN(C)C\C=C\C(=O)Nc1ccc2ncc(C#N)c(Nc3cccc(Br)c3)c2c1