Reaction Details
TargetAlpha-1B adrenergic receptor
LigandBDBM50006952
Substrate/Competitorn/a
Meas. Tech.ChEMBL_753882 (CHEMBL1798144)
Ki 1.82±n/a nM
Citation Romeo, GMateria, LModica, MNPittalà, VSalerno, LSiracusa, MAManetti, FBotta, MMinneman, KP Novel 4-phenylpiperidine-2,6-dione derivatives. Ligands fora1-adrenoceptor subtypes. Eur J Med Chem46:2676-90 (2011) 
 
Alpha-1B adrenergic receptor
Name:Alpha-1B adrenergic receptor
Type:Enzyme
Mol. Mass.:56862.13
Organism:Homo sapiens (Human)
Description:P35368
Residue:520
BDBM50006952
NameBDBM50006952
Synonyms:2-{2-[4-(2-Methoxy-phenyl)-piperazin-1-yl]-ethyl}-4,9-dihydro-2,4,9-triaza-fluorene-1,3-dione 3-{2-[4-(2-Methoxy-phenyl)-piperazin-1-yl]-ethyl}-1,5-dihydro-pyrimido[5,4-b]indole-2,4-dione | CHEMBL301707
TypeSmall organic molecule
Emp. Form.C23H25N5O3
Mol. Mass.419.4763
SMILESCOc1ccccc1N1CCN(CCn2c(=O)[nH]c3c4ccccc4[nH]c3c2=O)CC1