Reaction Details
TargetAlpha-1A adrenergic receptor
LigandBDBM50418765
Substrate/Competitorn/a
Meas. Tech.ChEMBL_753884 (CHEMBL1798146)
Ki 31.62±n/a nM
Citation Romeo, GMateria, LModica, MNPittalà, VSalerno, LSiracusa, MAManetti, FBotta, MMinneman, KP Novel 4-phenylpiperidine-2,6-dione derivatives. Ligands fora1-adrenoceptor subtypes. Eur J Med Chem46:2676-90 (2011) 
 
Alpha-1A adrenergic receptor
Name:Alpha-1A adrenergic receptor
Type:Cell-surface receptors
Mol. Mass.:51511.67
Organism:Homo sapiens (Human)
Description:P35348
Residue:466
BDBM50418765
NameBDBM50418765
Synonyms:CHEMBL1796046
TypeSmall organic molecule
Emp. Form.C27H35N3O3
Mol. Mass.449.5851
SMILESCOc1ccccc1N1CCN(CCCCN2C(=O)CC(C)(CC2=O)c2ccccc2)CC1