Reaction Details
TargetAlpha-1D adrenergic receptor
LigandBDBM50026917
Substrate/Competitorn/a
Meas. Tech.ChEMBL_753880 (CHEMBL1798142)
Ki 1.05±n/a nM
Citation Romeo, GMateria, LModica, MNPittalà, VSalerno, LSiracusa, MAManetti, FBotta, MMinneman, KP Novel 4-phenylpiperidine-2,6-dione derivatives. Ligands fora1-adrenoceptor subtypes. Eur J Med Chem46:2676-90 (2011) 
 
Alpha-1D adrenergic receptor
Name:Alpha-1D adrenergic receptor
Type:Enzyme Catalytic Domain
Mol. Mass.:60485.82
Organism:Homo sapiens (Human)
Description:adrenergic Alpha1D ADRA1D HUMAN::P25100
Residue:572
BDBM50026917
NameBDBM50026917
Synonyms:8-(2-(4-(2-methoxyphenyl)piperazin-1-yl)ethyl)-8-azaspiro[4.5]decane-7,9-dione 8-{2-[4-(2-Methoxy-phenyl)-piperazin-1-yl]-ethyl}-8-aza-spiro[4.5]decane-7,9-dione BMY 7378 CHEMBL1256934 CHEMBL543741
TypeSmall organic molecule
Emp. Form.C22H31N3O3
Mol. Mass.385.4998
SMILESCOc1ccccc1N1CCN(CCN2C(=O)CC3(CCCC3)CC2=O)CC1