Reaction Details
TargetSodium channel protein type 9 subunit alpha
LigandBDBM50418782
Substrate/Competitorn/a
Meas. Tech.ChEMBL_753412 (CHEMBL1799747)
IC50 38.02±n/a nM
Citation Macsari, ISandberg, LBesidski, YGravenfors, YGinman, TBylund, JBueters, TEriksson, ABLund, PEVenyike, EArvidsson, PI Phenyl isoxazole voltage-gated sodium channel blockers: structure and activity relationship. Bioorg Med Chem Lett21:3871-6 (2011) 
 
Sodium channel protein type 9 subunit alpha
Name:Sodium channel protein type 9 subunit alpha
Type:Protein
Mol. Mass.:226375.97
Organism:Homo sapiens (Human)
Description:Q15858
Residue:1988
BDBM50418782
NameBDBM50418782
Synonyms:CHEMBL1797401
TypeSmall organic molecule
Emp. Form.C20H19ClFN3O2
Mol. Mass.387.835
SMILESCc1onc(c1NC(=O)NCc1c(F)cccc1Cl)-c1c(C)cccc1C