Reaction Details
TargetAdenosine receptor A2a
LigandBDBM50207816
Substrate/Competitorn/a
Meas. Tech.ChEMBL_757209 (CHEMBL1803433)
Ki 25.12±n/a nM
Citation Zhukov, AAndrews, SPErrey, JCRobertson, NTehan, BMason, JSMarshall, FHWeir, MCongreve, M Biophysical mapping of the adenosine A2A receptor. J Med Chem54:4312-23 (2011) 
 
Adenosine receptor A2a
Name:Adenosine receptor A2a
Type:G Protein-Coupled Receptor (GPCR)
Mol. Mass.:44716.46
Organism:Homo sapiens (Human)
Description:P29274
Residue:412
BDBM50207816
NameBDBM50207816
Synonyms:CHEMBL273094 N-(2-Amino-ethyl)-2-[4-(2,6-dioxo-1,3-dipropyl-2,3,6,7-tetrahydro-1H-purin-8-yl)-phenoxy]-acetamide (xanthine amine congenere, XAC) N-(2-Amino-ethyl)-2-[4-(2,6-dioxo-1,3-dipropyl-2,3,6,9-tetrahydro-1H-purin-8-yl)-phenoxy]-acetamide XAC
TypeSmall organic molecule
Emp. Form.C21H28N6O4
Mol. Mass.428.4848
SMILESCCCn1c2nc([nH]c2c(=O)n(CCC)c1=O)-c1ccc(OCC(=O)NCCN)cc1