Reaction Details
TargetAdenosine receptor A2a
LigandBDBM50418842
Substrate/Competitorn/a
Meas. Tech.ChEMBL_757209 (CHEMBL1803433)
Ki 12.59±n/a nM
Citation Zhukov, AAndrews, SPErrey, JCRobertson, NTehan, BMason, JSMarshall, FHWeir, MCongreve, M Biophysical mapping of the adenosine A2A receptor. J Med Chem54:4312-23 (2011) 
 
Adenosine receptor A2a
Name:Adenosine receptor A2a
Type:G Protein-Coupled Receptor (GPCR)
Mol. Mass.:44716.46
Organism:Homo sapiens (Human)
Description:P29274
Residue:412
BDBM50418842
NameBDBM50418842
Synonyms:CHEMBL1800357
TypeSmall organic molecule
Emp. Form.C17H14FN5O
Mol. Mass.323.3244
SMILESNc1nc(nc(n1)-c1ccccc1O)N1Cc2ccc(F)cc2C1