Reaction Details
TargetDeoxyuridine 5'-triphosphate nucleotidohydrolase, mitochondrial
LigandBDBM50190543
Substrate/Competitorn/a
Meas. Tech.ChEMBL_758853 (CHEMBL1810457)
Ki 46000±n/a nM
Citation Recio, EMusso-Buendía, AVidal, AERuda, GFKasinathan, GNguyen, CRuiz-Pérez, LMGilbert, IHGonzález-Pacanowska, D Site-directed mutagenesis provides insights into the selective binding of trityl derivatives to Plasmodium falciparum dUTPase. Eur J Med Chem46:3309-14 (2011) 
 
Deoxyuridine 5'-triphosphate nucleotidohydrolase, mitochondrial
Name:Deoxyuridine 5'-triphosphate nucleotidohydrolase, mitochondrial
Type:Enzyme
Mol. Mass.:26574.03
Organism:Homo sapiens (Human)
Description:P33316
Residue:252
BDBM50190543
NameBDBM50190543
Synonyms:1-((2R,4S,5R)-4-hydroxy-5-((tritylamino)methyl)-tetrahydrofuran-2-yl)pyrimidine-2,4(1H,3H)-dione CHEMBL377582
TypeSmall organic molecule
Emp. Form.C28H27N3O4
Mol. Mass.469.5317
SMILESO[C@H]1C[C@@H](O[C@@H]1CNC(c1ccccc1)(c1ccccc1)c1ccccc1)n1ccc(=O)[nH]c1=O