Reaction Details
TargetVasopressin V1a receptor
LigandBDBM50418929
Substrate/Competitorn/a
Meas. Tech.ChEMBL_758215 (CHEMBL1810552)
Ki 0.0372±n/a nM
Citation Arbuckle, WBaker, JBarn, DBingham, MBrown, ABuchanan, KCraighead, MGoodwin, RGoutcher, SKiczun, MLyons, AMilne, RMontgomery, BNapier, SPresland, JSloan, HTurnbull, ZWishart, G Optimisation of pharmacokinetic properties to afford an orally bioavailable and selective V1A receptor antagonist. Bioorg Med Chem Lett21:4622-8 (2011) 
 
Vasopressin V1a receptor
Name:Vasopressin V1a receptor
Type:Receptor
Mol. Mass.:46820.18
Organism:Homo sapiens (Human)
Description:P37288
Residue:418
BDBM50418929
NameBDBM50418929
Synonyms:CHEMBL1807272
TypeSmall organic molecule
Emp. Form.C29H37ClFN3O2
Mol. Mass.514.074
SMILESCN(C)[C@H]1CC[C@@H](CC1)NC(=O)[C@@H](Cc1ccc(Cl)cc1)NC(=O)C1(CCCC1)c1ccc(F)cc1