Reaction Details
TargetSolute carrier family 15 member 1
LigandBDBM50418931
Substrate/Competitorn/a
Meas. Tech.ChEMBL_758406 (CHEMBL1811272)
Ki 257039578.28±n/a nM
Citation Thorn, KNielsen, CUJakobsen, PSteffansen, BZercher, CKBegtrup, M The tandem chain extension aldol reaction used for synthesis of ketomethylene tripeptidomimetics targeting hPEPT1. Bioorg Med Chem Lett21:4597-601 (2011) 
 
Solute carrier family 15 member 1
Name:Solute carrier family 15 member 1
Type:PROTEIN
Mol. Mass.:78818.07
Organism:Homo sapiens (Human)
Description:ChEMBL_1488839
Residue:708
BDBM50418931
NameBDBM50418931
Synonyms:CHEMBL1807351
TypeSmall organic molecule
Emp. Form.C15H21N3O5
Mol. Mass.323.3443
SMILESC[C@H](NC(=O)[C@H](CO)NC(=O)[C@@H](N)Cc1ccccc1)C(O)=O