Reaction Details
TargetSolute carrier family 15 member 1
LigandBDBM50418933
Substrate/Competitorn/a
Meas. Tech.ChEMBL_758406 (CHEMBL1811272)
Ki 123026877.08±n/a nM
Citation Thorn, KNielsen, CUJakobsen, PSteffansen, BZercher, CKBegtrup, M The tandem chain extension aldol reaction used for synthesis of ketomethylene tripeptidomimetics targeting hPEPT1. Bioorg Med Chem Lett21:4597-601 (2011) 
 
Solute carrier family 15 member 1
Name:Solute carrier family 15 member 1
Type:PROTEIN
Mol. Mass.:78818.07
Organism:Homo sapiens (Human)
Description:ChEMBL_1488839
Residue:708
BDBM50418933
NameBDBM50418933
Synonyms:CHEMBL1807356
TypeSmall organic molecule
Emp. Form.C24H30N3O6
Mol. Mass.456.511
SMILESCCC[C@H](NC(=O)[C@H](COC(=O)c1ccccc1)NC(=O)[C@@H]([NH3+])Cc1ccccc1)C(O)=O