Reaction Details
TargetSolute carrier family 15 member 1
LigandBDBM50418935
Substrate/Competitorn/a
Meas. Tech.ChEMBL_758406 (CHEMBL1811272)
Ki 251188643.15±n/a nM
Citation Thorn, KNielsen, CUJakobsen, PSteffansen, BZercher, CKBegtrup, M The tandem chain extension aldol reaction used for synthesis of ketomethylene tripeptidomimetics targeting hPEPT1. Bioorg Med Chem Lett21:4597-601 (2011) 
 
Solute carrier family 15 member 1
Name:Solute carrier family 15 member 1
Type:PROTEIN
Mol. Mass.:78818.07
Organism:Homo sapiens (Human)
Description:ChEMBL_1488839
Residue:708
BDBM50418935
NameBDBM50418935
Synonyms:CHEMBL1807353
TypeSmall organic molecule
Emp. Form.C25H31N2O6
Mol. Mass.455.5229
SMILESCCC[C@H](NC(=O)[C@H](COC(=O)c1ccccc1)CC(=O)[C@@H]([NH3+])Cc1ccccc1)C(O)=O