Reaction Details
TargetBeta-2 adrenergic receptor
LigandBDBM50318159
Substrate/Competitorn/a
Meas. Tech.ChEMBL_759384 (CHEMBL1810622)
EC50 16±n/a nM
Citation Connolly, SAlcaraz, LBailey, ACadogan, EChristie, JCook, ARFisher, AJHill, SHumphries, AIngall, AHKane, ZPaine, SPairaudeau, GStocks, MJYoung, A Design-driven LO: the discovery of new ultra long acting dibasicß2-adrenoceptor agonists. Bioorg Med Chem Lett21:4612-6 (2011) 
 
Beta-2 adrenergic receptor
Name:Beta-2 adrenergic receptor
Type:n/a
Mol. Mass.:46461.69
Organism:Homo sapiens (Human)
Description:P07550
Residue:413
BDBM50318159
NameBDBM50318159
Synonyms:8-Hydroxy-5-[(R)-1-hydroxy-2-(5,6-diethylindan-2-ylamino)-ethyl]-1H-quinolin-2-one INDACATEROL
TypeSmall organic molecule
Emp. Form.C24H28N2O3
Mol. Mass.392.4907
SMILESCCc1cc2CC(Cc2cc1CC)NC[C@H](O)c1ccc(O)c2[nH]c(=O)ccc12