Reaction Details
TargetD(2) dopamine receptor
LigandBDBM50418940
Substrate/Competitorn/a
Meas. Tech.ChEMBL_759383 (CHEMBL1810621)
IC50 3981±n/a nM
Citation Connolly, SAlcaraz, LBailey, ACadogan, EChristie, JCook, ARFisher, AJHill, SHumphries, AIngall, AHKane, ZPaine, SPairaudeau, GStocks, MJYoung, A Design-driven LO: the discovery of new ultra long acting dibasicß2-adrenoceptor agonists. Bioorg Med Chem Lett21:4612-6 (2011) 
 
D(2) dopamine receptor
Name:D(2) dopamine receptor
Type:Cell-surface receptors
Mol. Mass.:50647.10
Organism:Homo sapiens (Human)
Description:P14416
Residue:443
BDBM50418940
NameBDBM50418940
Synonyms:CHEMBL1807825
TypeSmall organic molecule
Emp. Form.C24H33N3O4S2
Mol. Mass.491.667
SMILESCCOc1ccc(CCNCCCSCCNC[C@H](O)c2ccc(O)c3[nH]c(=O)sc23)cc1