Reaction Details
TargetBeta-1 adrenergic receptor
LigandBDBM50128690
Substrate/Competitorn/a
Meas. Tech.ChEMBL_759387 (CHEMBL1810625)
IC50<10000±n/a nM
Citation Connolly, SAlcaraz, LBailey, ACadogan, EChristie, JCook, ARFisher, AJHill, SHumphries, AIngall, AHKane, ZPaine, SPairaudeau, GStocks, MJYoung, A Design-driven LO: the discovery of new ultra long acting dibasicß2-adrenoceptor agonists. Bioorg Med Chem Lett21:4612-6 (2011) 
 
Beta-1 adrenergic receptor
Name:Beta-1 adrenergic receptor
Type:G Protein-Coupled Receptor (GPCR)
Mol. Mass.:51338.40
Organism:Homo sapiens (Human)
Description:P08588
Residue:477
BDBM50128690
NameBDBM50128690
Synonyms:4-Hydroxy-7-{2-[2-(3-phenethyloxy-propane-1-sulfonyl)-ethylamino]-ethyl}-3H-benzothiazol-2-one SB-07499
TypeSmall organic molecule
Emp. Form.C22H28N2O5S2
Mol. Mass.464.598
SMILESOc1ccc(CCNCCS(=O)(=O)CCCOCCc2ccccc2)c2sc(=O)[nH]c12