Reaction Details
TargetD(2) dopamine receptor
LigandBDBM50418955
Substrate/Competitorn/a
Meas. Tech.ChEMBL_759383 (CHEMBL1810621)
IC50 794±n/a nM
Citation Connolly, SAlcaraz, LBailey, ACadogan, EChristie, JCook, ARFisher, AJHill, SHumphries, AIngall, AHKane, ZPaine, SPairaudeau, GStocks, MJYoung, A Design-driven LO: the discovery of new ultra long acting dibasicß2-adrenoceptor agonists. Bioorg Med Chem Lett21:4612-6 (2011) 
 
D(2) dopamine receptor
Name:D(2) dopamine receptor
Type:Cell-surface receptors
Mol. Mass.:50647.10
Organism:Homo sapiens (Human)
Description:P14416
Residue:443
BDBM50418955
NameBDBM50418955
Synonyms:CHEMBL1807831
TypeSmall organic molecule
Emp. Form.C22H28ClN3O5S2
Mol. Mass.514.058
SMILESO[C@@H](CNCCS(=O)(=O)CCCNCCc1cccc(Cl)c1)c1ccc(O)c2[nH]c(=O)sc12