Reaction Details
TargetMelatonin receptor type 1A
LigandBDBM50419034
Substrate/Competitorn/a
Meas. Tech.ChEMBL_762352 (CHEMBL1816423)
Ki 3.39±n/a nM
Citation Spadoni, GBedini, AOrlando, PLucarini, STarzia, GMor, MRivara, SLucini, VPannacci, MScaglione, F Bivalent ligand approach on N-{2-[(3-methoxyphenyl)methylamino]ethyl}acetamide: synthesis, binding affinity and intrinsic activity for MT(1) and MT(2) melatonin receptors. Bioorg Med Chem19:4910-6 (2011) 
 
Melatonin receptor type 1A
Name:Melatonin receptor type 1A
Type:Enzyme
Mol. Mass.:39392.94
Organism:Homo sapiens (Human)
Description:P48039
Residue:350
BDBM50419034
NameBDBM50419034
Synonyms:CHEMBL1813321
TypeSmall organic molecule
Emp. Form.C28H42N4O4
Mol. Mass.498.6575
SMILESCN(CCNC(C)=O)c1cccc(OCCCCCCOc2cccc(c2)N(C)CCNC(C)=O)c1