Reaction Details
TargetHistamine H4 receptor
LigandBDBM50326297
Substrate/Competitorn/a
Meas. Tech.ChEMBL_766543 (CHEMBL1826889)
Ki 100±n/a nM
Citation Verheij, MHde Graaf, Cde Kloe, GENijmeijer, SVischer, HFSmits, RAZuiderveld, OPHulscher, SSilvestri, LThompson, AJvan Muijlwijk-Koezen, JELummis, SCLeurs, Rde Esch, IJ Fragment library screening reveals remarkable similarities between the G protein-coupled receptor histamine H4 and the ion channel serotonin 5-HT3A. Bioorg Med Chem Lett21:5460-4 (2011) 
 
Histamine H4 receptor
Name:Histamine H4 receptor
Type:G Protein-Coupled Receptor (GPCR)
Mol. Mass.:44517.02
Organism:Homo sapiens (Human)
Description:Binding assays were using CHO cells stably expressing hH4R receptors.
Residue:390
BDBM50326297
NameBDBM50326297
Synonyms:3-((1H-imidazol-4-yl)methyl)pyridine CHEMBL78838
TypeSmall organic molecule
Emp. Form.C9H9N3
Mol. Mass.159.1879
SMILESC(c1cnc[nH]1)c1cccnc1