Reaction Details
Target5-hydroxytryptamine receptor 3A
LigandBDBM50419048
Substrate/Competitorn/a
Meas. Tech.ChEMBL_766545 (CHEMBL1827026)
Ki 1.58±n/a nM
Citation Verheij, MHde Graaf, Cde Kloe, GENijmeijer, SVischer, HFSmits, RAZuiderveld, OPHulscher, SSilvestri, LThompson, AJvan Muijlwijk-Koezen, JELummis, SCLeurs, Rde Esch, IJ Fragment library screening reveals remarkable similarities between the G protein-coupled receptor histamine H4 and the ion channel serotonin 5-HT3A. Bioorg Med Chem Lett21:5460-4 (2011) 
 
5-hydroxytryptamine receptor 3A
Name:5-hydroxytryptamine receptor 3A
Type:Protein
Mol. Mass.:55283.27
Organism:Homo sapiens (Human)
Description:P46098
Residue:478
BDBM50419048
NameBDBM50419048
Synonyms:CHEMBL1824048
TypeSmall organic molecule
Emp. Form.C14H16ClN3
Mol. Mass.261.75
SMILESCN1CCC(CC1)=Cc1nc2ccc(Cl)cc2[nH]1