Reaction Details
TargetPotassium/sodium hyperpolarization-activated cyclic nucleotide-gated channel 1
LigandBDBM50419059
Substrate/Competitorn/a
Meas. Tech.ChEMBL_767270 (CHEMBL1825382)
IC50>199526.23±n/a nM
Citation McClure, KJMaher, MWu, NChaplan, SREckert, WALee, DHWickenden, ADHermann, MAllison, BHawryluk, NBreitenbucher, JGGrice, CA Discovery of a novel series of selective HCN1 blockers. Bioorg Med Chem Lett21:5197-201 (2011) 
 
Potassium/sodium hyperpolarization-activated cyclic nucleotide-gated channel 1
Name:Potassium/sodium hyperpolarization-activated cyclic nucleotide-gated channel 1
Type:PROTEIN
Mol. Mass.:98811.53
Organism:Homo sapiens (Human)
Description:ChEMBL_767270
Residue:890
BDBM50419059
NameBDBM50419059
Synonyms:CHEMBL1823672
TypeSmall organic molecule
Emp. Form.C22H27N3O2
Mol. Mass.365.4687
SMILESCN1CCN(CC1)C1(CNC(=O)c2ccccc2O)Cc2ccccc2C1