Reaction Details
TargetPotassium/sodium hyperpolarization-activated cyclic nucleotide-gated channel 1
LigandBDBM50419061
Substrate/Competitorn/a
Meas. Tech.ChEMBL_767270 (CHEMBL1825382)
IC50 50118.72±n/a nM
Citation McClure, KJMaher, MWu, NChaplan, SREckert, WALee, DHWickenden, ADHermann, MAllison, BHawryluk, NBreitenbucher, JGGrice, CA Discovery of a novel series of selective HCN1 blockers. Bioorg Med Chem Lett21:5197-201 (2011) 
 
Potassium/sodium hyperpolarization-activated cyclic nucleotide-gated channel 1
Name:Potassium/sodium hyperpolarization-activated cyclic nucleotide-gated channel 1
Type:PROTEIN
Mol. Mass.:98811.53
Organism:Homo sapiens (Human)
Description:ChEMBL_767270
Residue:890
BDBM50419061
NameBDBM50419061
Synonyms:CHEMBL1823675
TypeSmall organic molecule
Emp. Form.C23H28N2O2
Mol. Mass.364.4806
SMILESCOc1ccccc1C(=O)NCC1(Cc2ccccc2C1)N1CCCCC1