Reaction Details
TargetPotassium/sodium hyperpolarization-activated cyclic nucleotide-gated channel 4
LigandBDBM50419056
Substrate/Competitorn/a
Meas. Tech.ChEMBL_767271 (CHEMBL1825383)
IC50>199526.23±n/a nM
Citation McClure, KJMaher, MWu, NChaplan, SREckert, WALee, DHWickenden, ADHermann, MAllison, BHawryluk, NBreitenbucher, JGGrice, CA Discovery of a novel series of selective HCN1 blockers. Bioorg Med Chem Lett21:5197-201 (2011) 
 
Potassium/sodium hyperpolarization-activated cyclic nucleotide-gated channel 4
Name:Potassium/sodium hyperpolarization-activated cyclic nucleotide-gated channel 4
Type:PROTEIN
Mol. Mass.:129069.19
Organism:Homo sapiens (Human)
Description:ChEMBL_1454251
Residue:1203
BDBM50419056
NameBDBM50419056
Synonyms:CHEMBL1823668
TypeSmall organic molecule
Emp. Form.C23H26F3N3O2
Mol. Mass.433.4666
SMILESCN1CCN(CC1)C1(CNC(=O)c2ccccc2OC(F)(F)F)Cc2ccccc2C1