Reaction Details
TargetPotassium/sodium hyperpolarization-activated cyclic nucleotide-gated channel 3
LigandBDBM50419083
Substrate/Competitorn/a
Meas. Tech.ChEMBL_767274 (CHEMBL1825386)
IC50 3162.28±n/a nM
Citation McClure, KJMaher, MWu, NChaplan, SREckert, WALee, DHWickenden, ADHermann, MAllison, BHawryluk, NBreitenbucher, JGGrice, CA Discovery of a novel series of selective HCN1 blockers. Bioorg Med Chem Lett21:5197-201 (2011) 
 
Potassium/sodium hyperpolarization-activated cyclic nucleotide-gated channel 3
Name:Potassium/sodium hyperpolarization-activated cyclic nucleotide-gated channel 3
Type:PROTEIN
Mol. Mass.:86065.62
Organism:Homo sapiens (Human)
Description:ChEMBL_767274
Residue:774
BDBM50419083
NameBDBM50419083
Synonyms:CHEMBL1823882
TypeSmall organic molecule
Emp. Form.C20H31N3O2
Mol. Mass.345.479
SMILESCCOc1ccccc1C(=O)NCC1(CCCCC1)N1CCNCC1