Reaction Details
TargetPotassium/sodium hyperpolarization-activated cyclic nucleotide-gated channel 4
LigandBDBM50419087
Substrate/Competitorn/a
Meas. Tech.ChEMBL_767271 (CHEMBL1825383)
IC50 39810.72±n/a nM
Citation McClure, KJMaher, MWu, NChaplan, SREckert, WALee, DHWickenden, ADHermann, MAllison, BHawryluk, NBreitenbucher, JGGrice, CA Discovery of a novel series of selective HCN1 blockers. Bioorg Med Chem Lett21:5197-201 (2011) 
 
Potassium/sodium hyperpolarization-activated cyclic nucleotide-gated channel 4
Name:Potassium/sodium hyperpolarization-activated cyclic nucleotide-gated channel 4
Type:PROTEIN
Mol. Mass.:129069.19
Organism:Homo sapiens (Human)
Description:ChEMBL_1454251
Residue:1203
BDBM50419087
NameBDBM50419087
Synonyms:CHEMBL1823676
TypeSmall organic molecule
Emp. Form.C24H30N2O2
Mol. Mass.378.5072
SMILESCCOc1ccccc1C(=O)NCC1(Cc2ccccc2C1)N1CCCCC1