Reaction Details
TargetPotassium/sodium hyperpolarization-activated cyclic nucleotide-gated channel 1
LigandBDBM50419081
Substrate/Competitorn/a
Meas. Tech.ChEMBL_767270 (CHEMBL1825382)
IC50>199526.23±n/a nM
Citation McClure, KJMaher, MWu, NChaplan, SREckert, WALee, DHWickenden, ADHermann, MAllison, BHawryluk, NBreitenbucher, JGGrice, CA Discovery of a novel series of selective HCN1 blockers. Bioorg Med Chem Lett21:5197-201 (2011) 
 
Potassium/sodium hyperpolarization-activated cyclic nucleotide-gated channel 1
Name:Potassium/sodium hyperpolarization-activated cyclic nucleotide-gated channel 1
Type:PROTEIN
Mol. Mass.:98811.53
Organism:Homo sapiens (Human)
Description:ChEMBL_767270
Residue:890
BDBM50419081
NameBDBM50419081
Synonyms:CHEMBL1823679
TypeSmall organic molecule
Emp. Form.C19H28ClN3O
Mol. Mass.349.898
SMILESCN1CCN(CC1)C1(CNC(=O)c2ccccc2Cl)CCCCC1