Reaction Details
TargetPotassium/sodium hyperpolarization-activated cyclic nucleotide-gated channel 4
LigandBDBM50419063
Substrate/Competitorn/a
Meas. Tech.ChEMBL_767271 (CHEMBL1825383)
IC50>199526.23±n/a nM
Citation McClure, KJMaher, MWu, NChaplan, SREckert, WALee, DHWickenden, ADHermann, MAllison, BHawryluk, NBreitenbucher, JGGrice, CA Discovery of a novel series of selective HCN1 blockers. Bioorg Med Chem Lett21:5197-201 (2011) 
 
Potassium/sodium hyperpolarization-activated cyclic nucleotide-gated channel 4
Name:Potassium/sodium hyperpolarization-activated cyclic nucleotide-gated channel 4
Type:PROTEIN
Mol. Mass.:129069.19
Organism:Homo sapiens (Human)
Description:ChEMBL_1454251
Residue:1203
BDBM50419063
NameBDBM50419063
Synonyms:CHEMBL1823678
TypeSmall organic molecule
Emp. Form.C20H31N3O
Mol. Mass.329.4796
SMILESCN1CCN(CC1)C1(CNC(=O)c2ccccc2C)CCCCC1