Reaction Details
TargetOrexin receptor type 2
LigandBDBM50417257
Substrate/Competitorn/a
Meas. Tech.ChEMBL_768074 (CHEMBL1833030)
Ki 0.398±n/a nM
Citation Di Fabio, RPellacani, AFaedo, SRoth, APiccoli, LGerrard, PPorter, RAJohnson, CNThewlis, KDonati, DStasi, LSpada, SStemp, GNash, DBranch, CKindon, LMassagrande, MPoffe, ABraggio, SChiarparin, EMarchioro, CRatti, ECorsi, M Discovery process and pharmacological characterization of a novel dual orexin 1 and orexin 2 receptor antagonist useful for treatment of sleep disorders. Bioorg Med Chem Lett21:5562-7 (2011) 
 
Orexin receptor type 2
Name:Orexin receptor type 2
Type:Protein
Mol. Mass.:50710.53
Organism:Homo sapiens (Human)
Description:O43614
Residue:444
BDBM50417257
NameBDBM50417257
Synonyms:SB-649868
TypeSmall organic molecule
Emp. Form.C26H24FN3O3S
Mol. Mass.477.55
SMILESCc1nc(C(=O)N2CCCC[C@H]2CNC(=O)c2cccc3occc23)c(s1)-c1ccc(F)cc1