Reaction Details
TargetTyrosine-protein kinase SYK
LigandBDBM50419262
Substrate/Competitorn/a
Meas. Tech.ChEMBL_772965 (CHEMBL1838853)
IC50 100±n/a nM
Citation Liddle, JAtkinson, FLBarker, MDCarter, PSCurtis, NRDavis, RPDouault, CDickson, MCElwes, DGarton, NSGray, MHayhow, TGHobbs, CIJones, ELeach, SLeavens, KLewis, HDMcCleary, SNeu, MPatel, VKPreston, AGRamirez-Molina, CShipley, TJSkone, PASmithers, NSomers, DOWalker, ALWatson, RJWeingarten, GG Discovery of GSK143, a highly potent, selective and orally efficacious spleen tyrosine kinase inhibitor. Bioorg Med Chem Lett21:6188-94 (2011) 
 
Tyrosine-protein kinase SYK
Name:Tyrosine-protein kinase SYK
Type:Enzyme
Mol. Mass.:72079.99
Organism:Homo sapiens (Human)
Description:P43405
Residue:635
BDBM50419262
NameBDBM50419262
Synonyms:CHEMBL1835068
TypeSmall organic molecule
Emp. Form.C18H22F2N6O
Mol. Mass.376.4037
SMILESCc1cccc(Nc2nc(N[C@@H]3CCC(F)(F)C[C@@H]3N)ncc2C(N)=O)c1