Reaction Details
TargetTyrosine-protein kinase SYK
LigandBDBM50419263
Substrate/Competitorn/a
Meas. Tech.ChEMBL_772965 (CHEMBL1838853)
IC50 25±n/a nM
Citation Liddle, JAtkinson, FLBarker, MDCarter, PSCurtis, NRDavis, RPDouault, CDickson, MCElwes, DGarton, NSGray, MHayhow, TGHobbs, CIJones, ELeach, SLeavens, KLewis, HDMcCleary, SNeu, MPatel, VKPreston, AGRamirez-Molina, CShipley, TJSkone, PASmithers, NSomers, DOWalker, ALWatson, RJWeingarten, GG Discovery of GSK143, a highly potent, selective and orally efficacious spleen tyrosine kinase inhibitor. Bioorg Med Chem Lett21:6188-94 (2011) 
 
Tyrosine-protein kinase SYK
Name:Tyrosine-protein kinase SYK
Type:Enzyme
Mol. Mass.:72079.99
Organism:Homo sapiens (Human)
Description:P43405
Residue:635
BDBM50419263
NameBDBM50419263
Synonyms:CHEMBL1835057
TypeSmall organic molecule
Emp. Form.C16H20N6O
Mol. Mass.312.3696
SMILESCc1cccc(Nc2nc(N[C@@H]3CCNC3)ncc2C(N)=O)c1