Reaction Details
TargetHistamine H4 receptor
LigandBDBM50419323
Substrate/Competitorn/a
Meas. Tech.ChEMBL_775966 (CHEMBL1912709)
Ki 14125.38±n/a nM
Citation Wagner, EWittmann, HJElz, SStrasser, A Mepyramine-JNJ7777120-hybrid compounds show high affinity to hH(1)R, but low affinity to hH(4)R. Bioorg Med Chem Lett21:6274-80 (2011) 
 
Histamine H4 receptor
Name:Histamine H4 receptor
Type:G Protein-Coupled Receptor (GPCR)
Mol. Mass.:44517.02
Organism:Homo sapiens (Human)
Description:Binding assays were using CHO cells stably expressing hH4R receptors.
Residue:390
BDBM50419323
NameBDBM50419323
Synonyms:CHEMBL1910385
TypeSmall organic molecule
Emp. Form.C33H43N7O2
Mol. Mass.569.7402
SMILESCOc1ccc(CN(CCN(C)CC(C)Nc2ccc3[nH]c(cc3c2)C(=O)N2CCN(C)CC2)c2ccccn2)cc1