Reaction Details
TargetHistamine H4 receptor
LigandBDBM50419326
Substrate/Competitorn/a
Meas. Tech.ChEMBL_775966 (CHEMBL1912709)
Ki 8912.51±n/a nM
Citation Wagner, EWittmann, HJElz, SStrasser, A Mepyramine-JNJ7777120-hybrid compounds show high affinity to hH(1)R, but low affinity to hH(4)R. Bioorg Med Chem Lett21:6274-80 (2011) 
 
Histamine H4 receptor
Name:Histamine H4 receptor
Type:G Protein-Coupled Receptor (GPCR)
Mol. Mass.:44517.02
Organism:Homo sapiens (Human)
Description:Binding assays were using CHO cells stably expressing hH4R receptors.
Residue:390
BDBM50419326
NameBDBM50419326
Synonyms:CHEMBL1910381
TypeSmall organic molecule
Emp. Form.C31H38N6O2
Mol. Mass.526.6724
SMILESCOc1ccc(CN(CCN(C)CCN2CCN(CC2)C(=O)c2cc3ccccc3[nH]2)c2ccccn2)cc1