Reaction Details
TargetHistamine H1 receptor
LigandBDBM50419324
Substrate/Competitorn/a
Meas. Tech.ChEMBL_775917 (CHEMBL1912890)
Ki 457.09±n/a nM
Citation Wagner, EWittmann, HJElz, SStrasser, A Mepyramine-JNJ7777120-hybrid compounds show high affinity to hH(1)R, but low affinity to hH(4)R. Bioorg Med Chem Lett21:6274-80 (2011) 
 
Histamine H1 receptor
Name:Histamine H1 receptor
Type:G Protein-Coupled Receptor (GPCR)
Mol. Mass.:55808.72
Organism:Homo sapiens (Human)
Description:Cell pellets from SK-N-MC cells transfected with human H1 receptor were used in binding assay.
Residue:487
BDBM50419324
NameBDBM50419324
Synonyms:CHEMBL1910384
TypeSmall organic molecule
Emp. Form.C28H31N5O2
Mol. Mass.469.578
SMILESCOc1ccc(CN(CCN[C@H]2CCN(C2)C(=O)c2cc3ccccc3[nH]2)c2ccccn2)cc1