Reaction Details
TargetHistamine H1 receptor
LigandBDBM24226
Substrate/Competitorn/a
Meas. Tech.ChEMBL_775917 (CHEMBL1912890)
Ki 2.09±n/a nM
Citation Wagner, EWittmann, HJElz, SStrasser, A Mepyramine-JNJ7777120-hybrid compounds show high affinity to hH(1)R, but low affinity to hH(4)R. Bioorg Med Chem Lett21:6274-80 (2011) 
 
Histamine H1 receptor
Name:Histamine H1 receptor
Type:G Protein-Coupled Receptor (GPCR)
Mol. Mass.:55808.72
Organism:Homo sapiens (Human)
Description:Cell pellets from SK-N-MC cells transfected with human H1 receptor were used in binding assay.
Residue:487
BDBM24226
NameBDBM24226
Synonyms:1-[(4-fluorophenyl)methyl]-N-{1-[2-(4-methoxyphenyl)ethyl]piperidin-4-yl}-1H-1,3-benzodiazol-2-amine Astemizole, [O-Methyl-3H] Hismanal [3H]-ASTEMIZOLE cid_2247 | med.21724, Compound Astemizole
TypeRadiolabeled ligand
Emp. Form.C28H31FN4O
Mol. Mass.458.5703
SMILESCOc1ccc(CCN2CCC(CC2)Nc2nc3ccccc3n2Cc2ccc(F)cc2)cc1