Reaction Details
TargetHistamine H1 receptor
LigandBDBM50419327
Substrate/Competitorn/a
Meas. Tech.ChEMBL_775917 (CHEMBL1912890)
Ki 602.56±n/a nM
Citation Wagner, EWittmann, HJElz, SStrasser, A Mepyramine-JNJ7777120-hybrid compounds show high affinity to hH(1)R, but low affinity to hH(4)R. Bioorg Med Chem Lett21:6274-80 (2011) 
 
Histamine H1 receptor
Name:Histamine H1 receptor
Type:G Protein-Coupled Receptor (GPCR)
Mol. Mass.:55808.72
Organism:Homo sapiens (Human)
Description:Cell pellets from SK-N-MC cells transfected with human H1 receptor were used in binding assay.
Residue:487
BDBM50419327
NameBDBM50419327
Synonyms:CHEMBL1910380
TypeSmall organic molecule
Emp. Form.C27H30N6O2
Mol. Mass.470.5661
SMILESCOc1ccc(CN(CCN2CCN(CC2)C(=O)c2nc3ccccc3[nH]2)c2ccccn2)cc1