Reaction Details
TargetSubstance-P receptor
LigandBDBM50419331
Substrate/Competitorn/a
Meas. Tech.ChEMBL_775934 (CHEMBL1912677)
Ki 0.251±n/a nM
Citation Catalani, MPAlvaro, GBernasconi, GBettini, EBromidge, SMHeer, JTedesco, GTommasi, S Identification of novel NK1/NK3 dual antagonists for the potential treatment of schizophrenia. Bioorg Med Chem Lett21:6899-904 (2011) 
 
Substance-P receptor
Name:Substance-P receptor
Type:G Protein-Coupled Receptor (GPCR)
Mol. Mass.:46254.43
Organism:Homo sapiens (Human)
Description:P25103
Residue:407
BDBM50419331
NameBDBM50419331
Synonyms:CHEMBL1911969
TypeSmall organic molecule
Emp. Form.C30H28F7N3O3
Mol. Mass.611.5504
SMILESCN(C(=O)C(C)(C)c1cc(cc(c1)C(F)(F)F)C(F)(F)F)c1cnc(cc1-c1ccc(F)cc1C)C1CC(=O)NC1CO