Reaction Details
TargetfMet-Leu-Phe receptor
LigandBDBM50419377
Substrate/Competitorn/a
Meas. Tech.ChEMBL_788190 (CHEMBL1919337)
IC50 5012±n/a nM
Citation Morley, ADCook, AKing, SRoberts, BLever, SWeaver, RMacdonald, CUnitt, JFagura, MPhillips, TLewis, RWenlock, M Discovery of pyrazoles as novel FPR1 antagonists. Bioorg Med Chem Lett21:6456-60 (2011) 
 
fMet-Leu-Phe receptor
Name:fMet-Leu-Phe receptor
Type:Enzyme Catalytic Domain
Mol. Mass.:38456.14
Organism:Homo sapiens (Human)
Description:gi_4503779
Residue:350
BDBM50419377
NameBDBM50419377
Synonyms:CHEMBL1916278
TypeSmall organic molecule
Emp. Form.C23H26N4O4S
Mol. Mass.454.542
SMILESCc1nn(c(NS(=O)(=O)c2ccc(C)cc2)c1C(=O)NC1CCOCC1)-c1ccccc1