Reaction Details
TargetfMet-Leu-Phe receptor
LigandBDBM50419372
Substrate/Competitorn/a
Meas. Tech.ChEMBL_788190 (CHEMBL1919337)
IC50 79±n/a nM
Citation Morley, ADCook, AKing, SRoberts, BLever, SWeaver, RMacdonald, CUnitt, JFagura, MPhillips, TLewis, RWenlock, M Discovery of pyrazoles as novel FPR1 antagonists. Bioorg Med Chem Lett21:6456-60 (2011) 
 
fMet-Leu-Phe receptor
Name:fMet-Leu-Phe receptor
Type:Enzyme Catalytic Domain
Mol. Mass.:38456.14
Organism:Homo sapiens (Human)
Description:gi_4503779
Residue:350
BDBM50419372
NameBDBM50419372
Synonyms:CHEMBL1916271
TypeSmall organic molecule
Emp. Form.C27H29N5O4S
Mol. Mass.519.615
SMILESCCN(C1CCCCC1)C(=O)c1cnn(c1NS(=O)(=O)c1ccc(cc1)-c1cnco1)-c1ccccc1