Reaction Details
TargetCytochrome P450 2D6
LigandBDBM50419356
Substrate/Competitorn/a
Meas. Tech.ChEMBL_788271 (CHEMBL1919534)
IC50<10000±n/a nM
Citation Morley, ADCook, AKing, SRoberts, BLever, SWeaver, RMacdonald, CUnitt, JFagura, MPhillips, TLewis, RWenlock, M Discovery of pyrazoles as novel FPR1 antagonists. Bioorg Med Chem Lett21:6456-60 (2011) 
 
Cytochrome P450 2D6
Name:Cytochrome P450 2D6
Type:Protein
Mol. Mass.:55774.82
Organism:Homo sapiens (Human)
Description:P10635
Residue:497
BDBM50419356
NameBDBM50419356
Synonyms:CHEMBL1916288
TypeSmall organic molecule
Emp. Form.C24H26FN5O3S
Mol. Mass.483.558
SMILESC[C@H](NC(=O)c1c(C)nn(c1NS(=O)(=O)c1ccc(cc1)C#N)-c1ccc(F)cc1)C(C)(C)C