Reaction Details
TargetHistamine H4 receptor
LigandBDBM50419452
Substrate/Competitorn/a
Meas. Tech.ChEMBL_789900 (CHEMBL1925207)
Ki 31.62±n/a nM
Citation Istyastono, EPNijmeijer, SLim, HDvan de Stolpe, ARoumen, LKooistra, AJVischer, HFde Esch, IJLeurs, Rde Graaf, C Molecular determinants of ligand binding modes in the histamine H(4) receptor: linking ligand-based three-dimensional quantitative structure-activity relationship (3D-QSAR) models to in silico guided receptor mutagenesis studies. J Med Chem54:8136-47 (2011) 
 
Histamine H4 receptor
Name:Histamine H4 receptor
Type:G Protein-Coupled Receptor (GPCR)
Mol. Mass.:44517.02
Organism:Homo sapiens (Human)
Description:Binding assays were using CHO cells stably expressing hH4R receptors.
Residue:390
BDBM50419452
NameBDBM50419452
Synonyms:CHEMBL1923030
TypeSmall organic molecule
Emp. Form.C18H30N4S
Mol. Mass.334.523
SMILESC(CSC(NC1CCCC1)=NC1CCCCC1)Cc1cnc[nH]1